{"text_format":"1","workbook":"xlsx","n_sheets":10,"sheets":["READ ME","INPUT_Pre-check","INPUT_Weight setting","INPUT_Geophysical Parameters","INPUT_Business Conditions","OUTPUT_Result","Translate","Calculations","Lists","Lists 2"],"not_rendered":{"charts":9,"images":46,"macros":1,"external_links":1,"defined_names":20,"comments":4,"pivot_tables":0},"unopened":[],"bounds":{"document_bytes":16777216,"sheet_cells":100000,"rows_first":2000,"rows_last":500,"rows_between":2000,"halvings":0,"cell_chars":16384,"cell_head_chars":4096},"cells_cut":0,"cells_raw":0,"read":"whole","date_system":"1900"}

{"sheet":"READ ME","index":0,"n_rows":48,"n_cols":4,"rows_kept":48,"cut":false,"hidden":false,"merged":[[42,2,42,5],[44,2,44,5],[46,2,46,5],[38,3,38,5],[39,3,39,5],[33,2,33,5],[34,3,34,5],[35,3,35,5],[36,3,36,5],[37,3,37,5],[27,3,27,5],[28,3,28,5],[29,3,29,5],[30,3,30,5],[31,3,31,5],[26,2,26,3],[11,2,11,5],[12,2,12,5],[14,2,14,5],[16,2,16,5],[17,2,17,5],[18,2,18,5],[19,2,19,5],[20,2,20,5],[21,2,21,5],[22,2,22,5],[23,2,23,5],[25,2,25,5],[10,2,10,3],[4,2,4,5],[9,2,9,5],[2,3,2,5],[5,2,6,3],[7,2,7,3]]}
[]
[]
[null,null,{"$f":"Translate!$C$20","v":"Select language"},"English"]
[]
[null,null,{"$f":"Translate!$C$21","v":"Read Me Sheet"}]
[]
[]
[]
[]
[null,null,{"$f":"Translate!$C$22","v":"Market – Market Assessment tool"}]
{"$rows_left_out":39}
{"sheet":"INPUT_Pre-check","index":1,"n_rows":31,"n_cols":21,"rows_kept":31,"cut":false,"hidden":false,"merged":[[27,5,27,7],[30,5,30,7],[29,5,29,8],[28,5,28,8],[13,19,16,19],[15,17,16,17],[15,18,16,18],[21,1,22,15],[20,14,20,15],[3,0,3,15],[7,3,7,11],[8,3,8,11],[15,0,19,0],[16,6,17,6],[16,7,17,7],[16,8,17,8],[16,9,17,9],[16,10,17,10],[10,0,11,0],[16,3,17,3],[16,4,17,4],[16,14,17,14],[14,2,14,13],[15,2,15,13],[1,4,1,10],[2,4,2,12],[18,14,19,14],[15,15,19,15],[9,1,9,8],[5,3,5,11],[6,3,6,11],[15,1,17,1],[16,13,17,13],[16,11,17,11],[16,12,17,12],[16,5,17,5],[12,2,12,13],[13,2,13,13],[10,1,11,13],[16,2,17,2]]}
[]
[null,null,null,null,{"$f":"Translate!$C$57","v":"INPUT - Pre-check"}]
[]
[]
[]
[null,{"$f":"Translate!$C$58","v":"Country:"},null,"Select the country of Interest"]
[null,{"$f":"Translate!$C$59","v":"Specific area of interest:"}]
[null,{"$f":"Translate!$C$60","v":"Assessment date:"}]
[null,{"$f":"Translate!$C$58","v":"Country:"}]
[]
{"$rows_left_out":22}
{"sheet":"INPUT_Weight setting","index":2,"n_rows":41,"n_cols":9,"rows_kept":41,"cut":false,"hidden":false,"merged":[[11,1,11,5],[10,1,10,5],[4,5,6,5],[3,0,3,5],[35,3,35,5]]}
[]
[null,null,null,{"$f":"Translate!$C$324","v":"INPUT - Weight setting"}]
[]
[]
[]
[null,{"$f":"Translate!$C$325","v":"Geophysical  Parameters:"}]
[null,{"$f":"Translate!$C$326","v":"Non-critical Geophysical Parameters"}]
[null,{"$f":"Translate!$C$327","v":"Additional parameters that are key to the market assessment for SPIS. These do not affect the general viability of SPIS; they affect the success of SPIS adoption in a region as per prevailing geophysical conditions (e.g. groundwater table, frost occurrence, topography, agricultural production farming system, etc.). "}]
[null,"Important"]
[null,{"$f":"H40","v":0.1}]
{"$rows_left_out":32}
{"sheet":"INPUT_Geophysical Parameters","index":3,"n_rows":17,"n_cols":10,"rows_kept":17,"cut":false,"hidden":false,"merged":[[3,0,3,5],[13,2,13,3],[10,2,10,3],[1,2,1,3],[7,2,7,3],[8,2,8,3],[9,2,9,3],[14,2,14,3],[15,2,15,3],[16,2,16,3],[11,1,11,5],[4,0,5,0],[6,2,6,3],[4,1,5,3]]}
[]
[null,null,{"$f":"Translate!$C$369","v":"INPUT - Geophysical Parameters"}]
[]
[]
[2,{"$f":"Translate!$C$370","v":"Additional Geophysical Parameters"},null,null,{"$f":"Translate!$C$373","v":"Highest Possible Score"},{"$f":"Translate!$C$374","v":"Attained Score"}]
[null,null,null,null,{"$f":"'INPUT_Weight setting'!B10","v":0.1},{"$f":"SUM(I8:I11)","v":9.0000000000000011E-2}]
[null,{"$f":"Translate!$C$371","v":"Questions"},{"$f":"Translate!$C$372","v":"Sample Data Sources"},null,{"$f":"Translate!$C$375","v":"Answer"},{"$f":"Translate!$C$376","v":"Relevance"},null,{"$f":"Translate!$C$403","v":"Weight"},{"$f":"Translate!$C$404","v":"Attained Score"},{"$f":"Translate!$C$405","v":"Raw Score"}]
["a)",{"$f":"Translate!$C$377","v":"What is the average groundwater table earmarked for SPIS?"},{"$f":"Translate!$C$381","v":"Estimated depth of groundwater resources"},null,"Up to 7 m","Inconsequential",null,{"$f":"E6/COUNTA(B8,B9,B10,B11)","v":2.5000000000000001E-2},{"$f":"(J8*H8)","v":2.5000000000000001E-2},{"$f":"VLOOKUP(E8,Table5[],2,FALSE)*VLOOKUP(F8,Table1[],2,FALSE)/6","v":1}]
["b)",{"$f":"Translate!$C$378","v":"What is the minimum annual ambient temperature and in particular the frequency of frost?"},{"$f":"Translate!$C$382","v":"AQUASTAT - Climate Information Tool"},null,"1 °C to 30 °C","Inconsequential",null,{"$f":"(E6/COUNTA(B8,B9,B10,B11))","v":2.5000000000000001E-2},{"$f":"(J9*H9)","v":2.5000000000000001E-2},{"$f":"IF(E9='Lists 2'!$Q$3,(VLOOKUP(F9,Table1[],2,FALSE))/6,(VLOOKUP(F9,Table1[],3,FALSE))/6)","v":1}]
["c)",{"$f":"Translate!$C$379","v":"What is the general topography of the area considered?"},{"$f":"Translate!$C$383","v":"What is the slope of the area?"},null,"Flat","Inconsequential",null,{"$f":"(E6/COUNTA(B8,B9,B10,B11))","v":2.5000000000000001E-2},{"$f":"(J10*H10)","v":2.5000000000000001E-2},{"$f":"VLOOKUP(E10,Table6[],2,FALSE)*VLOOKUP(F10,Table1[],2,FALSE)/6","v":1}]
{"$rows_left_out":8}
{"sheet":"INPUT_Business Conditions","index":4,"n_rows":108,"n_cols":10,"rows_kept":108,"cut":false,"hidden":false,"merged":[[59,0,60,0],[7,7,9,7],[7,8,9,8],[7,9,9,9],[1,2,1,3],[13,0,14,0],[13,1,14,3],[14,7,14,9],[4,0,5,0],[4,1,5,3],[5,7,5,9],[6,2,6,3],[10,2,10,3],[7,1,9,1],[7,5,9,5],[7,0,9,0],[7,2,9,2],[7,4,9,4],[3,0,3,5],[17,8,19,8],[17,9,19,9],[19,2,19,3],[21,0,22,0],[17,7,19,7],[104,2,104,3],[105,2,105,3],[106,2,106,3],[107,2,107,3],[15,2,15,3],[17,1,18,1],[17,4,19,4],[66,1,66,5],[62,1,62,5],[61,2,61,3],[59,1,60,3],[57,2,57,3],[99,2,101,3],[81,2,81,3],[82,2,82,3],[84,5,85,5],[84,4,85,4],[86,4,87,4],[21,1,22,3],[17,5,19,5],[28,3,29,3],[97,2,97,3],[102,1,102,5],[69,1,69,5],[17,0,18,0],[52,0,53,0],[34,0,35,0],[23,2,23,3],[39,0,43,0],[39,5,43,5],[38,2,38,3],[39,1,43,1],[43,2,43,3],[39,3,40,3],[39,4,43,4],[28,2,29,2],[33,1,33,5],[20,1,20,5],[39,7,43,7],[39,8,43,8],[39,9,43,9],[86,7,87,7],[86,8,87,8],[86,9,87,9],[83,7,85,7],[83,8,85,8],[98,1,98,5],[84,1,85,1],[92,1,92,5],[93,2,96,3],[83,9,85,9],[58,1,58,5],[51,1,51,5],[84,0,85,0],[84,3,87,3],[86,1,87,1],[86,0,87,0],[86,5,87,5],[89,1,90,3],[91,2,91,3],[89,0,90,0],[88,1,88,5],[84,2,87,2],[79,0,80,0],[70,0,71,0],[70,1,71,3],[72,2,72,3],[73,2,73,3],[74,2,74,3],[75,2,75,3],[76,2,76,3],[77,2,77,3],[79,1,80,3],[12,1,12,5],[78,1,78,5],[45,1,45,5],[24,1,24,5],[25,2,25,3],[26,2,26,3],[27,1,27,5],[30,1,30,5],[31,2,31,3],[32,2,32,3],[56,2,56,3],[55,2,55,3],[54,2,54,3],[52,1,53,3],[48,1,48,5],[37,1,37,5],[34,1,35,3],[63,2,65,3]]}
[]
[null,null,{"$f":"Translate!$C$407","v":"INPUT - Business Conditions Parameters"}]
[]
[]
[1,{"$f":"Translate!$C$408","v":"Government Interventions"},null,null,{"$f":"Translate!$C$411","v":"Highest Possible Score"},{"$f":"Translate!$C$412","v":"Attained Score"}]
[null,null,null,null,{"$f":"'INPUT_Weight setting'!B16","v":0.1},{"$f":" IF(OR(AND(E8=\"No\",F8=\"Critical\"),AND(E11=\"No\",F11=\"Critical\"),AND(E12=\"No\",F12=\"Critical\")),0,SUM(I8:I12))","v":0.1}]
[null,{"$f":"Translate!$C$409","v":"Questions"},{"$f":"Translate!$C$410","v":"Sample Data Sources"},null,{"$f":"Translate!$C$413","v":"Answer"},{"$f":"Translate!$C$414","v":"Relevance"},null,{"$f":"Translate!$C$430","v":"Weight"},{"$f":"Translate!$C$431","v":"Attained Score"},{"$f":"Translate!$C$432","v":"Raw Score"}]
["a)",{"$f":"IF('INPUT_Pre-check'!$D$6 =Translate!$C$91,Translate!$C$415 &\" \"& \"…..\" &Translate!$C$416,Translate!$C$415 &\" \"& 'INPUT_Pre-check'!$D$6 &Translate!$C$416)","v":"Are there government, national and local policies and laws promoting solar and irrigation equipment in …..?"},{"$f":"Translate!$C$417","v":"• Government irrigation and/or solar policies, laws, bills, acts, sector development plans\n• Licensing of solar technicians, suppliers and  or contractor companies\n• Government tax regulation such as duty and VAT exemptions"},{"$f":"Translate!$C$418","v":"Clean energy development policies"},"Yes","Inconsequential",null,{"$f":"E6/COUNTA(B8:B12)","v":3.3333333333333333E-2},{"$f":"(J8*H8)","v":3.3333333333333333E-2},{"$f":"IF(E8='Lists 2'!$K$11,VLOOKUP('INPUT_Business Conditions'!F8,'Lists 2'!$M$11:$O$15,2,FALSE)/6,VLOOKUP('INPUT_Business Conditions'!F8,'Lists 2'!$M$11:$O$15,3,FALSE)/6)","v":1}]
[null,null,null,{"$f":"Translate!$C$419","v":"Renewable Energy Targets and Policies, 2020: Table 6, Pg. 84"}]
[null,null,null,{"$f":"Translate!$C$420","v":"Asia Pacific countries policy documents"}]
{"$rows_left_out":99}
{"sheet":"OUTPUT_Result","index":5,"n_rows":52,"n_cols":12,"rows_kept":52,"cut":false,"hidden":false,"merged":[[51,1,51,12],[6,1,6,12],[8,1,8,4],[22,1,22,12],[8,7,8,12],[1,2,1,10],[3,9,3,10],[4,9,4,10],[3,7,3,8],[4,7,4,8],[4,2,4,6],[3,2,3,6]]}
[]
[null,null,{"$f":"Translate!$C$599","v":"OUTPUT - Market Assessment Results"}]
[]
[null,{"$f":"Translate!$C$600","v":"Country:"},{"$f":"'INPUT_Pre-check'!D6","v":"Select the country of Interest"},null,null,null,null,{"$f":"Translate!$C$602","v":"Assessment date:"},null,{"$f":"'INPUT_Pre-check'!D8","v":"00:00:00"}]
[null,{"$f":"Translate!$C$601","v":"Specific area of interest:"},{"$f":"'INPUT_Pre-check'!D7","v":0},null,null,null,null,{"$f":"Translate!$C$603","v":"Assessor name:"},null,{"$f":"'INPUT_Pre-check'!D9","v":0}]
[]
[null,{"$f":"Translate!$C$604","v":"A. Market Potential for SPIS: Score and Relevances"}]
[]
[null,{"$f":"Translate!$C$605","v":"Total Score (%)"},null,null,null,null,null,{"$f":"Translate!$C$606","v":"Overview of Relevance Ratings"}]
[]
{"$rows_left_out":43}
{"sheet":"Translate","index":6,"n_rows":677,"n_cols":7,"rows_kept":677,"cut":false,"hidden":false,"merged":[[1,1,2,2],[4,1,4,8],[6,1,12,1]]}
[]
[null,{"$f":"$C$15","v":"Do not modify this sheet"}]
[]
[]
[null,{"$f":"$C$16","v":"Reference Row"}]
[null,{"$f":"$C$17","v":"Selected Language:"},{"$f":"'READ ME'!$D$3","v":"English"},"English","Français","Español","العربية"]
[null,{"$f":"$C$18","v":"Sheet name"},{"$f":"HLOOKUP($C$6,$D$6:$I$701,ROW()-ROW($B$5),FALSE)","v":"READ ME"},"READ ME","LISER MOI","LÉEME","اقرأ هذه الصفحة"]
[null,null,{"$f":"HLOOKUP($C$6,$D$6:$I$701,ROW()-ROW($B$5),FALSE)","v":"INPUT_Pre-check"},"INPUT_Pre-check","INTRANT_Vérification préliminaire","ENTRADA_Precontrol","المدخلات_التحقق المسبق"]
[null,null,"INPUT_Weight setting","INPUT_Weight setting","INTRANT_Facteurs de pondération","ENTRADA_Ajuste de valoración","المدخلات_تحديد الأهمية"]
[null,null,"INPUT_Geophysical Parameters","INPUT_Geophysical Parameters","INTRANT_Paramètres géophysique","ENTRADA_Parámetros Geofísicos","المدخلات_المعلمات الجيوفيزيائية "]
{"$rows_left_out":668}
{"sheet":"Calculations","index":7,"n_rows":36,"n_cols":7,"rows_kept":36,"cut":false,"hidden":true,"merged":[]}
[]
[]
[null,"Enabling SPIS Business Factors",{"$f":"Translate!C625","v":"Initial weight setting"},{"$f":"Translate!C626","v":"Actually attained score "},"Difference ",null,"Attained Score"]
[1,"Geophysical Parameters",{"$f":"'INPUT_Geophysical Parameters'!E6","v":0.1},{"$f":"'INPUT_Geophysical Parameters'!F6","v":9.0000000000000011E-2},{"$f":"C4-D4","v":9.999999999999995E-3},{"$f":"100%-C4","v":0.9},{"$f":"D4/C4","v":0.9}]
[2,"Government interventions",{"$f":"'INPUT_Business Conditions'!E6","v":0.1},{"$f":"'INPUT_Business Conditions'!F6","v":0.1},{"$f":"C5-D5","v":0},{"$f":"100%-C5","v":0.9},{"$f":"D5/C5","v":1}]
[3,"Development Organizations Interventions",{"$f":"'INPUT_Business Conditions'!E15","v":0.1},{"$f":"'INPUT_Business Conditions'!F15","v":0.1},{"$f":"C6-D6","v":0},{"$f":"100%-C6","v":0.9},1]
[4,"Financing",{"$f":"'INPUT_Business Conditions'!E23","v":0.1},{"$f":"'INPUT_Business Conditions'!F23","v":0.1},0,0.9,1]
[5,"Availability  and cost of alternative sources of power for pumping",{"$f":"'INPUT_Business Conditions'!E36","v":0.1},{"$f":"'INPUT_Business Conditions'!F36","v":8.3333333333333332E-3},9.1666666666666674E-2,0.9,8.3333333333333329E-2]
[6,"Technical capacity for SPIS",{"$f":"'INPUT_Business Conditions'!E54","v":0.1},{"$f":"'INPUT_Business Conditions'!F54","v":0.1},0,0.9,1]
[7,"Awareness of solar PV and irrigation technologies ",{"$f":"'INPUT_Business Conditions'!E61","v":0.1},{"$f":"'INPUT_Business Conditions'!F61","v":9.1666666666666674E-2},8.3333333333333315E-3,0.9,0.91666666666666674]
{"$rows_left_out":27}
{"sheet":"Lists","index":8,"n_rows":228,"n_cols":7,"rows_kept":228,"cut":false,"hidden":true,"merged":[]}
["Countries","List of possible* development agencies and multilateral organizations: ","List of possible* facilities and funds:","List of possible* research centers and other NGOs:","Rural MPI","GNI per Capita","pump manufacturers"]
["Afghanistan ","African Development Bank","CTF (Clean Technology Fund)","AAA (Adaptation of African Agriculture)","0.10 - 1.86","Low income ($1,005 or less)","AllightSykes"]
["Albania ","CGIAR (Climate Change, Agriculture and Food Security)","EcoMicro","AGRA","1.87 - 8.80","Lower Middle Income ($1,006 to $3,955)","Ebara"]
["Algeria ","DFID ( Department for International Development - United Kingdom)","GEF (Global Environment Facility)","Energy 4Impact","8.81 - 26.06","Upper Middle Income ($3,956 to $12,235)","Flowserve"]
["American Samoa ","FAO (Food and Agriculture Organization) ","GPOBA (Global Partnershi on Output Based Aid)","IFPRI (International Food Policy Research Institute)","26.07 - 48.54","High Income ($12.236 or more)","Grundfos"]
["Andorra ","GACSA (Global Alliance For Climate-Smart Agriculture)","ICBA","Lutheran World Relief","48.55 - 68.29",null,"Kirloskar Brothers Lt"]
["Angola ","GIZ (Deutsche Gesellschaft für Internationale Zusammenarbeit GmbH)","ICBA (International Center for Biosaline Agriculture)","The Practica Foundation","68.30 - 84.33",null,"KSB"]
["Anguilla ","IFAD (International Fund for Agriculture Development)",null,null,"84.34 - 96.90",null,"Lorentz"]
["Antigua & Barbuda ","JICA (Japan International Cooperation Agency)",null,null,"No data",null,"Ruhrpumpen Group"]
["Argentina ","Nordic Development Fund",null,null,null,null,"Suzler Ltd"]
{"$rows_left_out":219}
{"sheet":"Lists 2","index":9,"n_rows":197,"n_cols":36,"rows_kept":197,"cut":false,"hidden":true,"merged":[]}
["Land Cover","Suitability","Weight Setting","Weight","Country",null,null,"Solar Ranges",null,"Groundwater Depth","Weight",null,"Relevance","Weight 1","Weight 2",null,"Ambient temperature",null,"Topography","Weight",null,"Farming System","Weight",null,"Population Density",null,{"$f":"Translate!C438","v":"List of possible* development agencies and multilateral organizations: "},null,{"$f":"Translate!C454","v":"List of possible* facilities and funds:"},null,{"$f":"Translate!C461","v":"List of possible* research centers and other NGOs:"},null,"GNI per Capita","Weight",null,"Pump manufacturers"]
[{"$f":"Translate!C288","v":"Cropland, rainfed"},{"$f":"Translate!$C$305","v":"Highly Suitable"},{"$f":"Translate!$C$359","v":"Ignore"},0,{"$f":"Translate!C91","v":"Select the country of Interest"},null,null,"0 - 948",null,{"$f":"Translate!C385","v":"Up to 7 m"},1,null,{"$f":"Translate!$C$360","v":"Inconsequential"},6,6,null,{"$f":"Translate!C391","v":"Below 1 °C"},null,{"$f":"Translate!C393","v":"Flat"},1,null,{"$f":"Translate!C396","v":"Seasonal Crops"},0.6,null,"<1",null,{"$f":"Translate!C439","v":"African Development Bank"},null,{"$f":"Translate!C455","v":"CTF (Clean Technology Fund)"},null,{"$f":"Translate!C462","v":"AAA (Adaptation of African Agriculture)"},null,{"$f":"Translate!C477","v":"Low income ($1,005 or less)"},1,null,"AllightSykes"]
[{"$f":"Translate!C289","v":"Cropland irrigated or post-flooding"},{"$f":"Translate!$C$305","v":"Highly Suitable"},{"$f":"Translate!$C$360","v":"Inconsequential"},2,{"$f":"Translate!C92","v":"Afghanistan"},null,null,"949 - 1094",null,{"$f":"Translate!C386","v":"7 m - 25 m"},0.8,null,{"$f":"Translate!$C$361","v":"Slightly important"},5,4,null,{"$f":"Translate!C392","v":"1 °C to 30 °C"},null,{"$f":"Translate!C394","v":"Moderate"},0.8,null,{"$f":"Translate!C397","v":"Perennial Crops"},0.8,null,"1 - 5",null,{"$f":"Translate!C440","v":"CGIAR (Consultative Group for International Agricultural Research)"},null,{"$f":"Translate!C456","v":"EcoMicro"},null,{"$f":"Translate!C463","v":"AGRA"},null,{"$f":"Translate!C478","v":"Lower Middle Income ($1,006 to $3,955)"},2,null,"Ebara"]
[{"$f":"Translate!C290","v":"Mosaic crop land with natural vegetation"},{"$f":"Translate!$C$305","v":"Highly Suitable"},{"$f":"Translate!$C$361","v":"Slightly important"},4,{"$f":"Translate!C93","v":"Albania"},null,null,"1095 - 1460",null,{"$f":"Translate!C387","v":"25 m - 50 m"},0.6,null,{"$f":"Translate!$C$362","v":"Important"},4,2,null,null,null,{"$f":"Translate!C395","v":"Steep"},0.6,null,{"$f":"Translate!C398","v":"Small Livestock"},1,null,"5 - 25",null,{"$f":"Translate!C441","v":"DFID (Department for International Development - United Kingdom)"},null,{"$f":"Translate!C457","v":"GEF (Global Environment Facility)"},null,{"$f":"Translate!C464","v":"Energy 4Impact"},null,{"$f":"Translate!C479","v":"Upper Middle Income ($3,956 to $12,235)"},4,null,"Flowserve"]
[{"$f":"Translate!C291","v":"Light forest open (tree cover up to 40%)"},{"$f":"Translate!$C$306","v":"Moderately Suitable"},{"$f":"Translate!$C$362","v":"Important"},6,{"$f":"Translate!C94","v":"Algeria"},null,null,{"$f":"Translate!$C$309","v":"Above 1460"},null,{"$f":"Translate!C388","v":"50 m - 100 m"},0.1,null,{"$f":"Translate!$C$363","v":"Very important"},3,1,null,null,null,null,null,null,{"$f":"Translate!C399","v":"Large Livestock"},0.9,null,"25 - 250",null,{"$f":"Translate!C442","v":"FAO (Food and Agriculture Organization) "},null,{"$f":"Translate!C458","v":"GPRBA (Global Partnership for Results-Based Approaches)"},null,{"$f":"Translate!C465","v":"IFPRI (International Food Policy Research Institute)"},null,{"$f":"Translate!C480","v":"High Income ($12.236 or more)"},5,null,"Grundfos"]
[{"$f":"Translate!C292","v":"Medium forest open to closed (tree cover above 40%)"},{"$f":"Translate!$C$307","v":"Marginally Suitable"},{"$f":"Translate!$C$363","v":"Very important"},8,{"$f":"Translate!C95","v":"Andorra"},null,null,null,null,{"$f":"Translate!C389","v":"Beyond 100 m"},0,null,{"$f":"Translate!$C$364","v":"Critical"},2,0,null,null,null,null,null,null,{"$f":"Translate!C400","v":"Seasonal and Perennial Crops"},0.7,null,"250 - 1000",null,{"$f":"Translate!C443","v":"GACSA (Global Alliance For Climate-Smart Agriculture)"},null,{"$f":"Translate!C459","v":"ICBA"},null,{"$f":"Translate!C466","v":"Lutheran World Relief"},null,null,null,null,"Kirloskar Brothers Lt"]
[{"$f":"Translate!C293","v":"Dense forest closed (tree cover above 40%)"},{"$f":"Translate!$C$308","v":"Not Suitable"},{"$f":"Translate!$C$364","v":"Critical"},10,{"$f":"Translate!C96","v":"Angola"},null,null,null,null,{"$f":"Translate!C390","v":"Unknown"},0,null,null,null,null,null,null,null,null,null,null,{"$f":"Translate!C401","v":"Livestock and Crops"},0.7,null,">1000",null,{"$f":"Translate!C444","v":"GIZ (German Corporation for International Cooperation GmbH)"},null,{"$f":"Translate!C460","v":"ICBA (International Center for Biosaline Agriculture)"},null,{"$f":"Translate!C467","v":"The Practica Foundation"},null,null,null,null,"KSB"]
[{"$f":"Translate!C294","v":"Shrubland"},{"$f":"Translate!$C$306","v":"Moderately Suitable"},null,null,{"$f":"Translate!C97","v":"Antigua and Barbuda"},null,null,null,null,null,null,null,null,null,null,null,null,null,null,null,null,null,null,null,null,null,{"$f":"Translate!C445","v":"IFAD (International Fund for Agriculture Development)"},null,null,null,null,null,null,null,null,"Lorentz"]
[{"$f":"Translate!C295","v":"Grassland"},{"$f":"Translate!$C$306","v":"Moderately Suitable"},null,null,{"$f":"Translate!C98","v":"Argentina"},null,null,null,null,null,null,null,"for INPUT_Business Conditions",null,null,null,null,null,null,null,null,null,null,null,null,null,{"$f":"Translate!C446","v":"JICA (Japan International Cooperation Agency)"},null,null,null,null,null,null,null,null,"Ruhrpumpen Group"]
[{"$f":"Translate!C296","v":"Lichens and mosses"},{"$f":"Translate!$C$307","v":"Marginally Suitable"},null,null,{"$f":"Translate!C99","v":"Armenia"},null,null,null,null,null,"YES/NO",null,"Relevance","Weight 1","Weight 3",null,"Relevance",null,null,null,null,"Outage frequency","Weight",null,"Population",null,{"$f":"Translate!C447","v":"Nordic Development Fund"},null,null,null,null,null,null,null,null,"Suzler Ltd"]
{"$rows_left_out":187}